vagrant cannot find version of Virtualbox on Windows 10 - ruby

I realize this is a recurring/known bug, but I have tried various approaches to fixing this and still no dice. So here goes (again):
I'm using
2. Vagrant 2.0.3
3. VirtualBox-5.1.26-117224-Win
4. Windows 10 (x64).
As you will see, I can execute vboxmanage manually from the terminal (using Git bash here because I prefer it, but same is happening in cmd). I have tried changing the path to use short notation, tried reinstalling both vagrant and virtualbox, installing both in paths that don't contain spaces (notice the underscore in "c:/Program_Files" below) and I'm getting slightly annoyed at vagrant for not working properly.
The reported output is
$ vagrant up --debug
INFO global: Vagrant version: 2.0.3
INFO global: Ruby version: 2.4.3
INFO global: RubyGems version: 2.6.14
INFO global: VAGRANT_EXECUTABLE="C:\\HashiCorp\\Vagrant\\embedded\\gems\\2.0.3\\gems\\vagrant-2.0.3\\bin\\vagrant"
INFO global: VAGRANT_INSTALLER_EMBEDDED_DIR="C:\\HashiCorp\\Vagrant\\embedded"
INFO global: VAGRANT_INSTALLER_ENV="1"
INFO global: VAGRANT_INSTALLER_VERSION="2"
INFO global: VAGRANT_LOG="debug"
INFO global: resolv replacement has been enabled!
INFO global: Plugins:
DEBUG bundler: Current generated plugin dependency list: []
DEBUG bundler: Generating new builtin set instance.
DEBUG bundler: Generating new plugin set instance. Skip gems - []
DEBUG bundler: Activating solution set: []
DEBUG global: Loading core plugin: C:/HashiCorp/Vagrant/embedded/gems/2.0.3/gems/vagrant-2.0.3/plugins/commands/box/plugin.rb
INFO manager: Registered plugin: box command
DEBUG global: Loading core plugin: C:/HashiCorp/Vagrant/embedded/gems/2.0.3/gems/vagrant-2.0.3/plugins/commands/cap/plugin.rb
INFO manager: Registered plugin: cap command
DEBUG global: Loading core plugin: C:/HashiCorp/Vagrant/embedded/gems/2.0.3/gems/vagrant-2.0.3/plugins/commands/destroy/plugin.rb
INFO manager: Registered plugin: destroy command
DEBUG global: Loading core plugin: C:/HashiCorp/Vagrant/embedded/gems/2.0.3/gems/vagrant-2.0.3/plugins/commands/global-status/plugin.rb
INFO manager: Registered plugin: global-status command
DEBUG global: Loading core plugin: C:/HashiCorp/Vagrant/embedded/gems/2.0.3/gems/vagrant-2.0.3/plugins/commands/halt/plugin.rb
INFO manager: Registered plugin: halt command
DEBUG global: Loading core plugin: C:/HashiCorp/Vagrant/embedded/gems/2.0.3/gems/vagrant-2.0.3/plugins/commands/help/plugin.rb
INFO manager: Registered plugin: help command
DEBUG global: Loading core plugin: C:/HashiCorp/Vagrant/embedded/gems/2.0.3/gems/vagrant-2.0.3/plugins/commands/init/plugin.rb
INFO manager: Registered plugin: init command
DEBUG global: Loading core plugin: C:/HashiCorp/Vagrant/embedded/gems/2.0.3/gems/vagrant-2.0.3/plugins/commands/list-commands/plugin.rb
INFO manager: Registered plugin: list-commands command
DEBUG global: Loading core plugin: C:/HashiCorp/Vagrant/embedded/gems/2.0.3/gems/vagrant-2.0.3/plugins/commands/login/plugin.rb
INFO manager: Registered plugin: vagrant-login
DEBUG global: Loading core plugin: C:/HashiCorp/Vagrant/embedded/gems/2.0.3/gems/vagrant-2.0.3/plugins/commands/package/plugin.rb
INFO manager: Registered plugin: package command
DEBUG global: Loading core plugin: C:/HashiCorp/Vagrant/embedded/gems/2.0.3/gems/vagrant-2.0.3/plugins/commands/plugin/plugin.rb
INFO manager: Registered plugin: plugin command
DEBUG global: Loading core plugin: C:/HashiCorp/Vagrant/embedded/gems/2.0.3/gems/vagrant-2.0.3/plugins/commands/port/plugin.rb
INFO manager: Registered plugin: port command
DEBUG global: Loading core plugin: C:/HashiCorp/Vagrant/embedded/gems/2.0.3/gems/vagrant-2.0.3/plugins/commands/powershell/plugin.rb
INFO manager: Registered plugin: powershell command
DEBUG global: Loading core plugin: C:/HashiCorp/Vagrant/embedded/gems/2.0.3/gems/vagrant-2.0.3/plugins/commands/provider/plugin.rb
INFO manager: Registered plugin: provider command
DEBUG global: Loading core plugin: C:/HashiCorp/Vagrant/embedded/gems/2.0.3/gems/vagrant-2.0.3/plugins/commands/provision/plugin.rb
INFO manager: Registered plugin: provision command
DEBUG global: Loading core plugin: C:/HashiCorp/Vagrant/embedded/gems/2.0.3/gems/vagrant-2.0.3/plugins/commands/push/plugin.rb
INFO manager: Registered plugin: push command
DEBUG global: Loading core plugin: C:/HashiCorp/Vagrant/embedded/gems/2.0.3/gems/vagrant-2.0.3/plugins/commands/rdp/plugin.rb
INFO manager: Registered plugin: rdp command
DEBUG global: Loading core plugin: C:/HashiCorp/Vagrant/embedded/gems/2.0.3/gems/vagrant-2.0.3/plugins/commands/reload/plugin.rb
INFO manager: Registered plugin: reload command
DEBUG global: Loading core plugin: C:/HashiCorp/Vagrant/embedded/gems/2.0.3/gems/vagrant-2.0.3/plugins/commands/resume/plugin.rb
INFO manager: Registered plugin: resume command
DEBUG global: Loading core plugin: C:/HashiCorp/Vagrant/embedded/gems/2.0.3/gems/vagrant-2.0.3/plugins/commands/snapshot/plugin.rb
INFO manager: Registered plugin: snapshot command
DEBUG global: Loading core plugin: C:/HashiCorp/Vagrant/embedded/gems/2.0.3/gems/vagrant-2.0.3/plugins/commands/ssh/plugin.rb
INFO manager: Registered plugin: ssh command
DEBUG global: Loading core plugin: C:/HashiCorp/Vagrant/embedded/gems/2.0.3/gems/vagrant-2.0.3/plugins/commands/ssh_config/plugin.rb
INFO manager: Registered plugin: ssh-config command
DEBUG global: Loading core plugin: C:/HashiCorp/Vagrant/embedded/gems/2.0.3/gems/vagrant-2.0.3/plugins/commands/status/plugin.rb
INFO manager: Registered plugin: status command
DEBUG global: Loading core plugin: C:/HashiCorp/Vagrant/embedded/gems/2.0.3/gems/vagrant-2.0.3/plugins/commands/suspend/plugin.rb
INFO manager: Registered plugin: suspend command
DEBUG global: Loading core plugin: C:/HashiCorp/Vagrant/embedded/gems/2.0.3/gems/vagrant-2.0.3/plugins/commands/up/plugin.rb
INFO manager: Registered plugin: up command
DEBUG global: Loading core plugin: C:/HashiCorp/Vagrant/embedded/gems/2.0.3/gems/vagrant-2.0.3/plugins/commands/validate/plugin.rb
INFO manager: Registered plugin: validate command
DEBUG global: Loading core plugin: C:/HashiCorp/Vagrant/embedded/gems/2.0.3/gems/vagrant-2.0.3/plugins/commands/version/plugin.rb
INFO manager: Registered plugin: version command
DEBUG global: Loading core plugin: C:/HashiCorp/Vagrant/embedded/gems/2.0.3/gems/vagrant-2.0.3/plugins/communicators/ssh/plugin.rb
INFO manager: Registered plugin: ssh communicator
DEBUG global: Loading core plugin: C:/HashiCorp/Vagrant/embedded/gems/2.0.3/gems/vagrant-2.0.3/plugins/communicators/winrm/plugin.rb
INFO manager: Registered plugin: winrm communicator
DEBUG global: Loading core plugin: C:/HashiCorp/Vagrant/embedded/gems/2.0.3/gems/vagrant-2.0.3/plugins/communicators/winssh/plugin.rb
INFO manager: Registered plugin: windows ssh communicator
DEBUG global: Loading core plugin: C:/HashiCorp/Vagrant/embedded/gems/2.0.3/gems/vagrant-2.0.3/plugins/guests/alt/plugin.rb
INFO manager: Registered plugin: ALT Platform guest
DEBUG global: Loading core plugin: C:/HashiCorp/Vagrant/embedded/gems/2.0.3/gems/vagrant-2.0.3/plugins/guests/amazon/plugin.rb
INFO manager: Registered plugin: Amazon Linux guest
DEBUG global: Loading core plugin: C:/HashiCorp/Vagrant/embedded/gems/2.0.3/gems/vagrant-2.0.3/plugins/guests/arch/plugin.rb
INFO manager: Registered plugin: Arch guest
DEBUG global: Loading core plugin: C:/HashiCorp/Vagrant/embedded/gems/2.0.3/gems/vagrant-2.0.3/plugins/guests/atomic/plugin.rb
INFO manager: Registered plugin: Atomic Host guest
DEBUG global: Loading core plugin: C:/HashiCorp/Vagrant/embedded/gems/2.0.3/gems/vagrant-2.0.3/plugins/guests/bsd/plugin.rb
INFO manager: Registered plugin: BSD-based guest
DEBUG global: Loading core plugin: C:/HashiCorp/Vagrant/embedded/gems/2.0.3/gems/vagrant-2.0.3/plugins/guests/coreos/plugin.rb
INFO manager: Registered plugin: CoreOS guest
DEBUG global: Loading core plugin: C:/HashiCorp/Vagrant/embedded/gems/2.0.3/gems/vagrant-2.0.3/plugins/guests/darwin/plugin.rb
INFO manager: Registered plugin: Darwin guest
DEBUG global: Loading core plugin: C:/HashiCorp/Vagrant/embedded/gems/2.0.3/gems/vagrant-2.0.3/plugins/guests/debian/plugin.rb
INFO manager: Registered plugin: Debian guest
DEBUG global: Loading core plugin: C:/HashiCorp/Vagrant/embedded/gems/2.0.3/gems/vagrant-2.0.3/plugins/guests/dragonflybsd/plugin.rb
INFO manager: Registered plugin: DragonFly BSD guest
DEBUG global: Loading core plugin: C:/HashiCorp/Vagrant/embedded/gems/2.0.3/gems/vagrant-2.0.3/plugins/guests/elementary/plugin.rb
INFO manager: Registered plugin: Elementary guest
DEBUG global: Loading core plugin: C:/HashiCorp/Vagrant/embedded/gems/2.0.3/gems/vagrant-2.0.3/plugins/guests/esxi/plugin.rb
INFO manager: Registered plugin: ESXi guest.
DEBUG global: Loading core plugin: C:/HashiCorp/Vagrant/embedded/gems/2.0.3/gems/vagrant-2.0.3/plugins/guests/fedora/plugin.rb
INFO manager: Registered plugin: Fedora guest
DEBUG global: Loading core plugin: C:/HashiCorp/Vagrant/embedded/gems/2.0.3/gems/vagrant-2.0.3/plugins/guests/freebsd/plugin.rb
INFO manager: Registered plugin: FreeBSD guest
DEBUG global: Loading core plugin: C:/HashiCorp/Vagrant/embedded/gems/2.0.3/gems/vagrant-2.0.3/plugins/guests/funtoo/plugin.rb
INFO manager: Registered plugin: Funtoo guest
DEBUG global: Loading core plugin: C:/HashiCorp/Vagrant/embedded/gems/2.0.3/gems/vagrant-2.0.3/plugins/guests/gentoo/plugin.rb
INFO manager: Registered plugin: Gentoo guest
DEBUG global: Loading core plugin: C:/HashiCorp/Vagrant/embedded/gems/2.0.3/gems/vagrant-2.0.3/plugins/guests/haiku/plugin.rb
INFO manager: Registered plugin: Haiku guest
DEBUG global: Loading core plugin: C:/HashiCorp/Vagrant/embedded/gems/2.0.3/gems/vagrant-2.0.3/plugins/guests/kali/plugin.rb
INFO manager: Registered plugin: Kali guest
DEBUG global: Loading core plugin: C:/HashiCorp/Vagrant/embedded/gems/2.0.3/gems/vagrant-2.0.3/plugins/guests/linux/plugin.rb
INFO manager: Registered plugin: Linux guest.
DEBUG global: Loading core plugin: C:/HashiCorp/Vagrant/embedded/gems/2.0.3/gems/vagrant-2.0.3/plugins/guests/mint/plugin.rb
INFO manager: Registered plugin: Mint guest
DEBUG global: Loading core plugin: C:/HashiCorp/Vagrant/embedded/gems/2.0.3/gems/vagrant-2.0.3/plugins/guests/netbsd/plugin.rb
INFO manager: Registered plugin: NetBSD guest
DEBUG global: Loading core plugin: C:/HashiCorp/Vagrant/embedded/gems/2.0.3/gems/vagrant-2.0.3/plugins/guests/nixos/plugin.rb
INFO manager: Registered plugin: NixOS guest
DEBUG global: Loading core plugin: C:/HashiCorp/Vagrant/embedded/gems/2.0.3/gems/vagrant-2.0.3/plugins/guests/omnios/plugin.rb
INFO manager: Registered plugin: OmniOS guest.
DEBUG global: Loading core plugin: C:/HashiCorp/Vagrant/embedded/gems/2.0.3/gems/vagrant-2.0.3/plugins/guests/openbsd/plugin.rb
INFO manager: Registered plugin: OpenBSD guest
DEBUG global: Loading core plugin: C:/HashiCorp/Vagrant/embedded/gems/2.0.3/gems/vagrant-2.0.3/plugins/guests/photon/plugin.rb
INFO manager: Registered plugin: VMware Photon guest
DEBUG global: Loading core plugin: C:/HashiCorp/Vagrant/embedded/gems/2.0.3/gems/vagrant-2.0.3/plugins/guests/pld/plugin.rb
INFO manager: Registered plugin: PLD Linux guest
DEBUG global: Loading core plugin: C:/HashiCorp/Vagrant/embedded/gems/2.0.3/gems/vagrant-2.0.3/plugins/guests/redhat/plugin.rb
INFO manager: Registered plugin: Red Hat Enterprise Linux guest
DEBUG global: Loading core plugin: C:/HashiCorp/Vagrant/embedded/gems/2.0.3/gems/vagrant-2.0.3/plugins/guests/slackware/plugin.rb
INFO manager: Registered plugin: Slackware guest
DEBUG global: Loading core plugin: C:/HashiCorp/Vagrant/embedded/gems/2.0.3/gems/vagrant-2.0.3/plugins/guests/smartos/plugin.rb
INFO manager: Registered plugin: SmartOS guest.
DEBUG global: Loading core plugin: C:/HashiCorp/Vagrant/embedded/gems/2.0.3/gems/vagrant-2.0.3/plugins/guests/solaris/plugin.rb
INFO manager: Registered plugin: Solaris guest.
DEBUG global: Loading core plugin: C:/HashiCorp/Vagrant/embedded/gems/2.0.3/gems/vagrant-2.0.3/plugins/guests/solaris11/plugin.rb
INFO manager: Registered plugin: Solaris 11 guest.
DEBUG global: Loading core plugin: C:/HashiCorp/Vagrant/embedded/gems/2.0.3/gems/vagrant-2.0.3/plugins/guests/suse/plugin.rb
INFO manager: Registered plugin: SUSE guest
DEBUG global: Loading core plugin: C:/HashiCorp/Vagrant/embedded/gems/2.0.3/gems/vagrant-2.0.3/plugins/guests/tinycore/plugin.rb
INFO manager: Registered plugin: TinyCore Linux guest.
DEBUG global: Loading core plugin: C:/HashiCorp/Vagrant/embedded/gems/2.0.3/gems/vagrant-2.0.3/plugins/guests/trisquel/plugin.rb
INFO manager: Registered plugin: Trisquel guest
DEBUG global: Loading core plugin: C:/HashiCorp/Vagrant/embedded/gems/2.0.3/gems/vagrant-2.0.3/plugins/guests/ubuntu/plugin.rb
INFO manager: Registered plugin: Ubuntu guest
DEBUG global: Loading core plugin: C:/HashiCorp/Vagrant/embedded/gems/2.0.3/gems/vagrant-2.0.3/plugins/guests/windows/plugin.rb
INFO manager: Registered plugin: Windows guest.
DEBUG global: Loading core plugin: C:/HashiCorp/Vagrant/embedded/gems/2.0.3/gems/vagrant-2.0.3/plugins/hosts/alt/plugin.rb
INFO manager: Registered plugin: ALT Platform host
DEBUG global: Loading core plugin: C:/HashiCorp/Vagrant/embedded/gems/2.0.3/gems/vagrant-2.0.3/plugins/hosts/arch/plugin.rb
INFO manager: Registered plugin: Arch host
DEBUG global: Loading core plugin: C:/HashiCorp/Vagrant/embedded/gems/2.0.3/gems/vagrant-2.0.3/plugins/hosts/bsd/plugin.rb
INFO manager: Registered plugin: BSD host
DEBUG global: Loading core plugin: C:/HashiCorp/Vagrant/embedded/gems/2.0.3/gems/vagrant-2.0.3/plugins/hosts/darwin/plugin.rb
INFO manager: Registered plugin: Mac OS X host
DEBUG global: Loading core plugin: C:/HashiCorp/Vagrant/embedded/gems/2.0.3/gems/vagrant-2.0.3/plugins/hosts/freebsd/plugin.rb
INFO manager: Registered plugin: FreeBSD host
DEBUG global: Loading core plugin: C:/HashiCorp/Vagrant/embedded/gems/2.0.3/gems/vagrant-2.0.3/plugins/hosts/gentoo/plugin.rb
INFO manager: Registered plugin: Gentoo host
DEBUG global: Loading core plugin: C:/HashiCorp/Vagrant/embedded/gems/2.0.3/gems/vagrant-2.0.3/plugins/hosts/linux/plugin.rb
INFO manager: Registered plugin: Linux host
DEBUG global: Loading core plugin: C:/HashiCorp/Vagrant/embedded/gems/2.0.3/gems/vagrant-2.0.3/plugins/hosts/null/plugin.rb
INFO manager: Registered plugin: null host
DEBUG global: Loading core plugin: C:/HashiCorp/Vagrant/embedded/gems/2.0.3/gems/vagrant-2.0.3/plugins/hosts/redhat/plugin.rb
INFO manager: Registered plugin: Red Hat Enterprise Linux host
DEBUG global: Loading core plugin: C:/HashiCorp/Vagrant/embedded/gems/2.0.3/gems/vagrant-2.0.3/plugins/hosts/slackware/plugin.rb
INFO manager: Registered plugin: Slackware host
DEBUG global: Loading core plugin: C:/HashiCorp/Vagrant/embedded/gems/2.0.3/gems/vagrant-2.0.3/plugins/hosts/suse/plugin.rb
INFO manager: Registered plugin: SUSE host
DEBUG global: Loading core plugin: C:/HashiCorp/Vagrant/embedded/gems/2.0.3/gems/vagrant-2.0.3/plugins/hosts/windows/plugin.rb
INFO manager: Registered plugin: Windows host
DEBUG global: Loading core plugin: C:/HashiCorp/Vagrant/embedded/gems/2.0.3/gems/vagrant-2.0.3/plugins/kernel_v1/plugin.rb
INFO manager: Registered plugin: kernel
DEBUG global: Loading core plugin: C:/HashiCorp/Vagrant/embedded/gems/2.0.3/gems/vagrant-2.0.3/plugins/kernel_v2/plugin.rb
INFO manager: Registered plugin: kernel
DEBUG global: Loading core plugin: C:/HashiCorp/Vagrant/embedded/gems/2.0.3/gems/vagrant-2.0.3/plugins/providers/docker/plugin.rb
INFO manager: Registered plugin: docker-provider
DEBUG global: Loading core plugin: C:/HashiCorp/Vagrant/embedded/gems/2.0.3/gems/vagrant-2.0.3/plugins/providers/hyperv/plugin.rb
INFO manager: Registered plugin: Hyper-V provider
DEBUG global: Loading core plugin: C:/HashiCorp/Vagrant/embedded/gems/2.0.3/gems/vagrant-2.0.3/plugins/providers/virtualbox/plugin.rb
INFO manager: Registered plugin: VirtualBox provider
DEBUG global: Loading core plugin: C:/HashiCorp/Vagrant/embedded/gems/2.0.3/gems/vagrant-2.0.3/plugins/provisioners/ansible/plugin.rb
INFO manager: Registered plugin: ansible
DEBUG global: Loading core plugin: C:/HashiCorp/Vagrant/embedded/gems/2.0.3/gems/vagrant-2.0.3/plugins/provisioners/cfengine/plugin.rb
INFO manager: Registered plugin: CFEngine Provisioner
DEBUG global: Loading core plugin: C:/HashiCorp/Vagrant/embedded/gems/2.0.3/gems/vagrant-2.0.3/plugins/provisioners/chef/plugin.rb
INFO manager: Registered plugin: chef
DEBUG global: Loading core plugin: C:/HashiCorp/Vagrant/embedded/gems/2.0.3/gems/vagrant-2.0.3/plugins/provisioners/docker/plugin.rb
INFO manager: Registered plugin: docker
DEBUG global: Loading core plugin: C:/HashiCorp/Vagrant/embedded/gems/2.0.3/gems/vagrant-2.0.3/plugins/provisioners/file/plugin.rb
INFO manager: Registered plugin: file
DEBUG global: Loading core plugin: C:/HashiCorp/Vagrant/embedded/gems/2.0.3/gems/vagrant-2.0.3/plugins/provisioners/puppet/plugin.rb
INFO manager: Registered plugin: puppet
DEBUG global: Loading core plugin: C:/HashiCorp/Vagrant/embedded/gems/2.0.3/gems/vagrant-2.0.3/plugins/provisioners/salt/plugin.rb
INFO manager: Registered plugin: salt
DEBUG global: Loading core plugin: C:/HashiCorp/Vagrant/embedded/gems/2.0.3/gems/vagrant-2.0.3/plugins/provisioners/shell/plugin.rb
INFO manager: Registered plugin: shell
DEBUG global: Loading core plugin: C:/HashiCorp/Vagrant/embedded/gems/2.0.3/gems/vagrant-2.0.3/plugins/pushes/atlas/plugin.rb
INFO manager: Registered plugin: atlas
DEBUG global: Loading core plugin: C:/HashiCorp/Vagrant/embedded/gems/2.0.3/gems/vagrant-2.0.3/plugins/pushes/ftp/plugin.rb
INFO manager: Registered plugin: ftp
DEBUG global: Loading core plugin: C:/HashiCorp/Vagrant/embedded/gems/2.0.3/gems/vagrant-2.0.3/plugins/pushes/heroku/plugin.rb
INFO manager: Registered plugin: heroku
DEBUG global: Loading core plugin: C:/HashiCorp/Vagrant/embedded/gems/2.0.3/gems/vagrant-2.0.3/plugins/pushes/local-exec/plugin.rb
INFO manager: Registered plugin: local-exec
DEBUG global: Loading core plugin: INFO environment: Home path: C:/Users/sreenivasulanaidupot/.vagrant.d
DEBUG environment: Effective local data path: C:/Users/sreenivasulanaidupot/Desktop/ITGO-1074/orchestration-api/.vagrant
INFO environment: Local data path: C:/Users/sreenivasulanaidupot/Desktop/ITGO-1074/orchestration-api/.vagrant
DEBUG environment: Creating: C:/Users/sreenivasulanaidupot/Desktop/ITGO-1074/orchestration-api/.vagrant
INFO environment: Running hook: environment_plugins_loaded
INFO runner: Preparing hooks for middleware sequence...
INFO runner: 1 hooks defined.
INFO runner: Running action: environment_plugins_loaded #<Vagrant::Action::Builder:0x000000000471fb48>
INFO environment: Running hook: environment_load
INFO runner: Preparing hooks for middleware sequence...
INFO runner: 1 hooks defined.
INFO runner: Running action: environment_load #<Vagrant::Action::Builder:0x00000000045e05c0>
DEBUG checkpoint_client: starting plugin check
INFO cli: CLI: [] "up" []
DEBUG checkpoint_client: plugin check complete
DEBUG cli: Invoking command class: VagrantPlugins::CommandUp::Command []
DEBUG checkpoint_client: no information received from checkpoint
DEBUG command: 'Up' each target VM...
INFO loader: Set :root = ["#<Pathname:C:/Users/sreenivasulanaidupot/Desktop/ITGO-1074/orchestration-api/Vagrantfile>"]
DEBUG loader: Populating proc cache for #<Pathname:C:/Users/sreenivasulanaidupot/Desktop/ITGO-1074/orchestration-api/Vagrantfile>
DEBUG loader: Load procs for pathname: C:/Users/sreenivasulanaidupot/Desktop/ITGO-1074/orchestration-api/Vagrantfile
INFO loader: Loading configuration in order: [:home, :root]
DEBUG loader: Loading from: root (evaluating)
DEBUG loader: Configuration loaded successfully, finalizing and returning
DEBUG push: finalizing
DEBUG command: Getting target VMs for command. Arguments:
DEBUG command: -- names: ["default"]
DEBUG command: -- options: {:provider=>nil}
DEBUG command: Finding machine that match name: default
INFO loader: Set "37150820_machine_default" = []
INFO loader: Loading configuration in order: [:home, :root, "37150820_machine_default"]
DEBUG loader: Loading from: root (cache)
DEBUG loader: Configuration loaded successfully, finalizing and returning
DEBUG push: finalizing
INFO subprocess: Starting process: ["C:\\WINDOWS\\System32\\WindowsPowerShell\\v1.0/powershell.EXE", "-NoLogo", "-NoProfile", "-NonInteractive", "-ExecutionPolicy", "Bypass", "-Command", "Write-Output $PSVersionTable.PSVersion.Major"]
INFO subprocess: Command not in installer, restoring original environment...
DEBUG subprocess: Selecting on IO
DEBUG subprocess: stdout: 5
DEBUG subprocess: Waiting for process to exit. Remaining to timeout: 10
DEBUG subprocess: Exit status: 0
INFO subprocess: Starting process: ["C:\\WINDOWS\\System32\\WindowsPowerShell\\v1.0/powershell.EXE", "-NoLogo", "-NoProfile", "-NonInteractive", "-ExecutionPolicy", "Bypass", "-Command", "(new-object System.Security.Principal.WindowsPrincipal([System.Security.Principal.WindowsIdentity]::GetCurrent())).IsInRole([System.Security.Principal.WindowsBuiltInRole]::Administrator)"]
INFO subprocess: Command not in installer, restoring original environment...
DEBUG subprocess: Selecting on IO
DEBUG subprocess: stdout: False
DEBUG subprocess: Waiting for process to exit. Remaining to timeout: 31999
DEBUG subprocess: Exit status: 0
INFO subprocess: Starting process: ["C:\\WINDOWS\\System32\\WindowsPowerShell\\v1.0/powershell.EXE", "-NoLogo", "-NoProfile", "-NonInteractive", "-ExecutionPolicy", "Bypass", "-Command", "[System.Security.Principal.WindowsIdentity]::GetCurrent().Groups | ForEach-Object { if ($_.Value -eq 'S-1-5-32-578'){ Write-Host 'true'; break }}"]
INFO subprocess: Command not in installer, restoring original environment...
DEBUG subprocess: Selecting on IO
DEBUG subprocess: Waiting for process to exit. Remaining to timeout: 32000
DEBUG subprocess: Exit status: 0
DEBUG base: Windows, checking for VBoxManage on PATH first
INFO base: VBoxManage path: C:/Program Files/Oracle/VirtualBox/VBoxManage.exe
INFO subprocess: Starting process: ["C:/Program Files/Oracle/VirtualBox/VBoxManage.exe", "--version"]
INFO subprocess: Command not in installer, restoring original environment...
INFO environment: Running hook: environment_unload
INFO host: Autodetecting host type for [#<Vagrant::Environment: C:/Users/sreenivasulanaidupot/Desktop/ITGO-1074/orchestration-api>]
DEBUG host: Trying: alt
DEBUG host: Trying: arch
DEBUG host: Trying: darwin
DEBUG host: Trying: freebsd
DEBUG host: Trying: gentoo
DEBUG host: Trying: redhat
DEBUG host: Trying: slackware
DEBUG host: Trying: suse
DEBUG host: Trying: bsd
DEBUG host: Trying: linux
DEBUG host: Trying: null
DEBUG host: Trying: windows
INFO host: Detected: windows!
INFO runner: Preparing hooks for middleware sequence...
INFO runner: 1 hooks defined.
INFO runner: Running action: environment_unload #<Vagrant::Action::Builder:0x00000000044f0818>
C:/HashiCorp/Vagrant/embedded/gems/2.0.3/gems/childprocess-0.6.3/lib/childprocess/windows/handle.rb:12:in `open': Access is denied. (5) (ChildProcess::Error)
from C:/HashiCorp/Vagrant/embedded/gems/2.0.3/gems/childprocess-0.6.3/lib/childprocess/windows/process.rb:71:in `launch_process'
from C:/HashiCorp/Vagrant/embedded/gems/2.0.3/gems/childprocess-0.6.3/lib/childprocess/abstract_process.rb:82:in `start'
from C:/HashiCorp/Vagrant/embedded/gems/2.0.3/gems/vagrant-2.0.3/lib/vagrant/util/subprocess.rb:141:in `block in execute'
from C:/HashiCorp/Vagrant/embedded/gems/2.0.3/gems/vagrant-2.0.3/lib/vagrant/util/safe_chdir.rb:26:in `block (2 levels) in safe_chdir'
from C:/HashiCorp/Vagrant/embedded/gems/2.0.3/gems/vagrant-2.0.3/lib/vagrant/util/safe_chdir.rb:25:in `chdir'
from C:/HashiCorp/Vagrant/embedded/gems/2.0.3/gems/vagrant-2.0.3/lib/vagrant/util/safe_chdir.rb:enter code here25:in `block in safe_chdir'
from C:/HashiCorp/Vagrant/embedded/gems/2.0.3/gems/vagrant-2.0.3/lib/vagrant/util/safe_chdir.rb:24:in `synchronize'
from C:/HashiCorp/Vagrant/embedded/gems/2.0.3/gems/vagrant-2.0.3/lib/vagrant/util/safe_chdir.rb:24:in `safe_chdir'
from C:/HashiCorp/Vagrant/embedded/gems/2.0.3/gems/vagrant-2.0.3/lib/vagrant/util/subprocess.rb:140:in `execute'
from C:/HashiCorp/Vagrant/embedded/gems/2.0.3/gems/vagrant-2.0.3/lib/vagrant/util/subprocess.rb:22:in `execute'
from C:/HashiCorp/Vagrant/embedded/gems/2.0.3/gems/vagrant-2.0.3/plugins/providers/virtualbox/driver/base.rb:440:in `block in raw'
from C:/HashiCorp/Vagrant/embedded/gems/2.0.3/gems/vagrant-2.0.3/lib/vagrant/util/busy.rb:19:in `busy'
from C:/HashiCorp/Vagrant/embedded/gems/2.0.3/gems/vagrant-2.0.3/plugins/providers/virtualbox/driver/base.rb:439:in `raw'
from C:/HashiCorp/Vagrant/embedded/gems/2.0.3/gems/vagrant-2.0.3/plugins/providers/virtualbox/driver/base.rb:377:in `block in execute'
from C:/HashiCorp/Vagrant/embedded/gems/2.0.3/gems/vagrant-2.0.3/lib/vagrant/util/retryable.rb:17:in `retryable'
from C:/HashiCorp/Vagrant/embedded/gems/2.0.3/gems/vagrant-2.0.3/plugins/providers/virtualbox/driver/base.rb:372:in `execute'
from C:/HashiCorp/Vagrant/embedded/gems/2.0.3/gems/vagrant-2.0.3/plugins/providers/virtualbox/driver/meta.rb:161:in `block in read_version'
from C:/HashiCorp/Vagrant/embedded/gems/2.0.3/gems/vagrant-2.0.3/lib/vagrant/util/retryable.rb:17:in `retryable'
from C:/HashiCorp/Vagrant/embedded/gems/2.0.3/gems/vagrant-2.0.3/plugins/providers/virtualbox/driver/meta.rb:160:in `read_version'
from C:/HashiCorp/Vagrant/embedded/gems/2.0.3/gems/vagrant-2.0.3/plugins/providers/virtualbox/driver/meta.rb:46:in `block in initialize'
from C:/HashiCorp/Vagrant/embedded/gems/2.0.3/gems/vagrant-2.0.3/plugins/providers/virtualbox/driver/meta.rb:41:in `synchronize'
from C:/HashiCorp/Vagrant/embedded/gems/2.0.3/gems/vagrant-2.0.3/plugins/providers/virtualbox/driver/meta.rb:41:in `initialize'
from C:/HashiCorp/Vagrant/embedded/gems/2.0.3/gems/vagrant-2.0.3/plugins/providers/virtualbox/provider.rb:20:in `new'
from C:/HashiCorp/Vagrant/embedded/gems/2.0.3/gems/vagrant-2.0.3/plugins/providers/virtualbox/provider.rb:20:in `usable?'
from C:/HashiCorp/Vagrant/embedded/gems/2.0.3/gems/vagrant-2.0.3/lib/vagrant/environment.rb:340:in `block in default_provider'
from C:/HashiCorp/Vagrant/embedded/gems/2.0.3/gems/vagrant-2.0.3/lib/vagrant/registry.rb:49:in `block in each'
from C:/HashiCorp/Vagrant/embedded/gems/2.0.3/gems/vagrant-2.0.3/lib/vagrant/registry.rb:48:in `each'
from C:/HashiCorp/Vagrant/embedded/gems/2.0.3/gems/vagrant-2.0.3/lib/vagrant/registry.rb:48:in `each'
from C:/HashiCorp/Vagrant/embedded/gems/2.0.3/gems/vagrant-2.0.3/lib/vagrant/environment.rb:326:in `default_provider'
from C:/HashiCorp/Vagrant/embedded/gems/2.0.3/gems/vagrant-2.0.3/lib/vagrant/plugin/v2/command.rb:177:in `block in with_target_vms'
from C:/HashiCorp/Vagrant/embedded/gems/2.0.3/gems/vagrant-2.0.3/lib/vagrant/plugin/v2/command.rb:204:in `block in with_target_vms'
from C:/HashiCorp/Vagrant/embedded/gems/2.0.3/gems/vagrant-2.0.3/lib/vagrant/plugin/v2/command.rb:186:in `each'
from C:/HashiCorp/Vagrant/embedded/gems/2.0.3/gems/vagrant-2.0.3/lib/vagrant/plugin/v2/command.rb:186:in `with_target_vms'
from C:/HashiCorp/Vagrant/embedded/gems/2.0.3/gems/vagrant-2.0.3/plugins/commands/up/command.rb:87:in `execute'
from C:/HashiCorp/Vagrant/embedded/gems/2.0.3/gems/vagrant-2.0.3/lib/vagrant/cli.rb:46:in `execute'
from C:/HashiCorp/Vagrant/embedded/gems/2.0.3/gems/vagrant-2.0.3/lib/vagrant/environment.rb:269:in `cli'
from C:/HashiCorp/Vagrant/embedded/gems/2.0.3/gems/vagrant-2.0.3/bin/vagrant:151:in `<main>'

Related

ionic cordova build android fails

I am trying to run ionic cordova build android but its failing with below error:
PS C:\Users\Dell\Desktop\recipe> ionic cordova build android ? The
Ionic CLI (local version) has an update available (3.7.0 => 3.9.2)!
Would you like to install it? No [INFO] Not automatically updating
your CLI. You can update manually:
npm install --save-dev --save-exact ionic#latest
Running app-scripts build: --build --iscordovaserve --nobrowser
[00:09:37] build dev started ... [00:09:37] clean started ...
[00:09:37] clean finished in 12 ms [00:09:37] copy started ...
[00:09:37] transpile started ... [00:09:43] transpile finished in
5.09 s [00:09:43] preprocess started ... [00:09:43] deeplinks started ... [00:09:43] deeplinks finished in 127 ms [00:09:43]
preprocess finished in 129 ms [00:09:43] webpack started ...
[00:09:44] copy finished in 6.24 s [00:09:59] webpack finished in
15.82 s [00:09:59] sass started ... [00:10:02] sass finished in 3.59 s [00:10:02] postprocess started ... [00:10:02] postprocess finished
in 7 ms [00:10:02] lint started ... [00:10:02] build dev finished in
24.82 s
ionic cordova prepare
cordova prepare | Running command [00:10:09] tslint: C:/Users/Dell/Desktop/recipe/src/pages/shopping-list/shopping-list.ts,
line: 2
All imports are unused.
L1: import { Component } from '#angular/core';
L2: import { IonicPage, NavController, NavParams } from 'ionic-angular';
L3: import { IngredientService } from "../../service/shopping-list";
[00:10:09] tslint:
C:/Users/Dell/Desktop/recipe/src/pages/edit-recipe/edit-recipe.ts,
line: 3
All imports are unused.
L2: import { IonicPage, NavController, NavParams, ActionSheetController, AlertController, ToastController } from
'ionic-angular' ;
L3: import { Recipe } from "../../models/Recipe";
L4: import { FormGroup, FormControl, Validators, FormArray } from "#angular/forms";
[00:10:09] tslint:
C:/Users/Dell/Desktop/recipe/src/pages/tabs/tabs.ts, line: 2
All imports are unused.
L1: import { Component } from '#angular/core';
L2: import { IonicPage, NavController, NavParams } from 'ionic-angular';
L3: import { ShoppingListPage } from "../shopping-list/shopping-list";
[00:10:09] lint finished in 6.88 s √ Running command - done!
You have been opted out of telemetry. To change this, run: cordova
telemetry on.
cordova build android × Running command - failed!
[ERROR] Cordova encountered an error.
You may get more insight by running the Cordova command above directly.
[ERROR] An error occurred while running cordova build android (exit
code 1):
You have been opted out of telemetry. To change this, run: cordova telemetry on.
ANDROID_HOME=C:\Users\Dell\AppData\Local\Android\sdk
JAVA_HOME=C:\Program Files (x86)\java\jdk1.8.0_144
Subproject Path: CordovaLib
Starting a Gradle Daemon (subsequent builds will be faster)
FAILURE: Build failed with an exception.
* What went wrong:
Unable to start the daemon process.
This problem might be caused by incorrect configuration of the daemon.
For example, an unrecognized jvm option is used.
Please refer to the user guide chapter on the daemon at https://docs.gradle.org/3.3/userguide/gradle_daemon.html
Please read the following process output to find out more:
-----------------------
Error occurred during initialization of VM
Could not reserve enough space for 2097152KB object heap
* Try:
Run with --stacktrace option to get the stack trace. Run with --info or --debug option to get more log output.
Error: cmd: Command failed with exit code 1 Error output:
FAILURE: Build failed with an exception.
* What went wrong:
Unable to start the daemon process.
This problem might be caused by incorrect configuration of the daemon.
For example, an unrecognized jvm option is used.
Please refer to the user guide chapter on the daemon at https://docs.gradle.org/3.3/userguide/gradle_daemon.html
Please read the following process output to find out more:
-----------------------
Error occurred during initialization of VM
Could not reserve enough space for 2097152KB object heap
* Try:
Run with --stacktrace option to get the stack trace. Run with --info or --debug option to get more log output.
And this is what I get on running ionic info:
cli packages: (C:\Users\Dell\Desktop\recipe\node_modules)
#ionic/cli-plugin-cordova : 1.6.2
#ionic/cli-plugin-ionic-angular : 1.4.1
#ionic/cli-utils : 1.7.0
ionic (Ionic CLI) : 3.7.0
global packages:
Cordova CLI : 7.0.1
local packages:
#ionic/app-scripts : 2.1.3
Cordova Platforms : android 6.2.3
Ionic Framework : ionic-angular 3.6.0
System:
Node : v6.11.2
OS : Windows 10
npm : 5.3.0
I have android studio already installed and I did build an app before this one. Why do I get error on this one. Can someone asssist.

Kitchen hangs during test chef role

I have creating some chef cookbooks and all works correctly.
Now I want to use kitchen for testing my recipe and cookbooks.
Kitchen run on Linux centos 7 and I use virtualbox.
If I launch recipe to install ms_dotnet 4.5 on win server 2008 all works correctly.
If I launch the same recipe using kitchen on same platform chef client hangs on this message
update content in file (file sizes exceed 10000000 bytes, diff output suppressed)
If I open virtual box and show the desktop, the directory and the executable of .dotnet 4.5 is present.
And if I try to install the .dotnet 4.5 without kitchen all runs correctly.
How can I resolve my problems?
Thanks you so much
This is my kitchen config
driver:
name: vagrant
boot_timeout: 1200
provisioner:
name: chef_solo
require_chef_omnibus: 12.5.1
platforms:
- name: softsolutions/redhat72
- name: softsolutions/centos67
- name: softsolutions/centos7
- name: softsolutions/opensuse113
- name: softsolutions/win-2008r2-standard-amd64-nocm
transport:
name: winrm
- name: softsolutions/win-7-professional-amd64-nocm
transport:
name: winrm
suites:
#Roles for physical machines
- name: do-base
run_list:
- role[do-base]
And this is my kitchen log (when try to install dotnet 4.5)
I, [2017-02-24T15:39:41.503828 #31565] INFO -- do-developer-softsolutions-win-2008r2-standard-amd64-nocm: (up to date)
I, [2017-02-24T15:39:41.504670 #31565] INFO -- do-developer-softsolutions-win-2008r2-standard-amd64-nocm: * execute[set_for_current_shell] action run
I, [2017-02-24T15:39:41.505538 #31565] INFO -- do-developer-softsolutions-win-2008r2-standard-amd64-nocm: - execute PATH=%PATH%;C:\BuildTools\apache-maven\bin\
I, [2017-02-24T15:39:41.506393 #31565] INFO -- do-developer-softsolutions-win-2008r2-standard-amd64-nocm: Recipe: ms_dotnet45::default
I, [2017-02-24T15:39:41.507264 #31565] INFO -- do-developer-softsolutions-win-2008r2-standard-amd64-nocm: * windows_package[Microsoft .NET Framework 4.5] action install
I, [2017-02-24T15:39:44.344388 #31565] INFO -- do-developer-softsolutions-win-2008r2-standard-amd64-nocm: * remote_file[C:\Users\vagrant\AppData\Local\Temp\kitchen\cache/ms_dotnet-4.5.exe] action create
I, [2017-02-24T15:39:46.292294 #31565] INFO -- do-developer-softsolutions-win-2008r2-standard-amd64-nocm: - create new file C:\Users\vagrant\AppData\Local\Temp\kitchen\cache/ms_dotnet-4.5.exe
I, [2017-02-24T15:39:46.293742 #31565] INFO -- do-developer-softsolutions-win-2008r2-standard-amd64-nocm: - update content in file C:\Users\vagrant\AppData\Local\Temp\kitchen\cache/ms_dotnet-4.5.exe from none to 6c2c58
I, [2017-02-24T15:39:46.295069 #31565] INFO -- do-developer-softsolutions-win-2008r2-standard-amd64-nocm: (file sizes exceed 10000000 bytes, diff output suppressed)
I resolved my problems!
I modify my kitchen.yml and insert:
- name: softsolutions/win-2008r2-standard-amd64-nocm-sp1
transport:
name: winrm
elevated: true
elevated_username: System
elevated_password: null
Now msdotnet cookbook works correctly.
Thanks you

ionic $ An uncaught exception occured and has been reported to Ionic

first my project is work fine..... After restart System it show me the error(ionic $ An uncaught exception occured and has been reported to Ionic)
Gulp startup tasks: [ 'sass', 'watch' ]
Running live reload server: http://localhost:35729
Watching : [ 'www//', '!www/lib//' ]
Running dev server: http://localhost:8100
Ionic server commands, enter:
restart or r to restart the client app from the root
goto or g and a url to have the app navigate to the given url
consolelogs or c to enable/disable console log output
serverlogs or s to enable/disable server log output
quit or q to shutdown the server and exit
ionic $ An uncaught exception occured and has been reported to Ionic
spawn cmd ENOENT (CLI v1.4.5)
Your system information:
Cordova CLI: 5.1.1
Gulp version: CLI version 3.9.0
Gulp local: Local version 3.9.0
Ionic Version: 1.0.0
Ionic CLI Version: 1.4.5
Ionic App Lib Version: 0.0.22
OS: Windows 7 SP1
Node Version: v0.12.7
reinstall npm-ionic,bower,cordova but still problem not solved.
please help me thank you
Last resort. Restart your pc.
This error is basically from
ionic-cli, possible solutions kill all the npm server's running on
your local machine.
Remove the latest cli version and install an
older version of ionic-cli.

mvn spring:boot fails after running yo jhipster on Mac OS X

mvn spring:boot run gives me this error below.
After running you jhipster for the first time on Mac OS X lion.
I have not changed any file at all, just using generated pom.
mvn 3.0.4 and 3.1.1 both tried, java 1.7
Apache Maven 3.1.1 (0728685237757ffbf44136acec0402957f723d9a; 2013-09-17 11:22:22-0400)
Maven home: /Users/admin/installs/maven311
Java version: 1.7.0_60, vendor: Oracle Corporation
Java home: /Library/Java/JavaVirtualMachines/jdk1.7.0_60.jdk/Contents/Home/jre
Default locale: en_US, platform encoding: UTF-8
OS name: "mac os x", version: "10.7.5", arch: "x86_64", family: "mac"
Error log:
[INFO] ------------------------------------------------------------------------
[ERROR] No plugin found for prefix 'spring' in the current project and in the plugin groups [org.apache.maven.plugins, org.codehaus.mojo] available from the repositories [local (/Users/admin/.m2/repository), spring-snapshots (http://repo.spring.io/libs-snapshot), spring-milestones (http://repo.spring.io/milestone), central (http://repo.maven.apache.org/maven2)] -> [Help 1]
Try running with the following command instead:
mvn spring-boot:run
(note the dash between spring and boot and the colon between boot and run)

Error: java.io.IOException: build on Android device failed at task 'processDebugResources'

I am using Ubuntu 12.04.4 LTS and my android phone is
Samsung Galaxy S3 Neo I93001 Android version 4.3 and is connected successfully to the device.
~$ adb devices
List of devices attached
* daemon not running. starting it now on port 5037 *
* daemon started successfully *
4e1eb1e1 device
When trying to build a sample app in android device getting this error.
Execution failed for task ':CordovaLib:processDebugResources'.
java.io.IOException: Cannot run program
"/android-sdk-linux/build-tools/23.0.2/aapt": error=2, No such file or
directory
Try: Run with --stacktrace option to get the stack trace.
Run with --info or --debug option to get more log output.
BUILD FAILED
~/socially1-3$ meteor run android-device --verbose
Getting installed version for platform android in Cordova project
Checking Cordova requirements for platform Android
[[[[[ /socially1-3 ]]]]]
=> Started proxy.
=> Started MongoDB.
Local package version is up-to-date: accounts-base#1.2.2
....
Local package version is up-to-date: webapp-hashing#1.0.5
Preparing Cordova project from app bundle
Processing mobile-config.js
Copying resources for mobile apps
Writing new config.xml
Preparing Cordova project for platform Android
WARNING: You are testing your app on a remote device. For the mobile app to be able to connect to the local server, make sure your device is on
the same network, and that the network configuration allows clients to talk to each other (no client isolation).
Running Cordova app for platform Android with options --device
ANDROID_HOME=/android-sdk-linux
JAVA_HOME=/usr/lib/jvm/java-7-openjdk-amd64
Running: /socially1-3/.meteor/local/cordova-build/platforms/android/gradlew cdvBuildDebug -b /socially1-3/.meteor/local/cordova-build/platforms/android/build.gradle -PcdvBuildArch=arm -Dorg.gradle.daemon=true
=> Started your app.
=> App running at: http://localhost:3000/
:preBuild
:compileDebugNdk UP-TO-DATE
:preDebugBuild
:checkDebugManifest
:CordovaLib:compileLint
:CordovaLib:copyDebugLint UP-TO-DATE
:CordovaLib:mergeDebugProguardFiles UP-TO-DATE
:CordovaLib:preBuild
:CordovaLib:preDebugBuild
:CordovaLib:checkDebugManifest
:CordovaLib:prepareDebugDependencies
:CordovaLib:compileDebugAidl UP-TO-DATE
:CordovaLib:compileDebugRenderscript UP-TO-DATE
:CordovaLib:generateDebugBuildConfig UP-TO-DATE
:CordovaLib:generateDebugAssets UP-TO-DATE
:CordovaLib:mergeDebugAssets UP-TO-DATE
:CordovaLib:generateDebugResValues UP-TO-DATE
:CordovaLib:generateDebugResources UP-TO-DATE
:CordovaLib:packageDebugResources UP-TO-DATE
:CordovaLib:processDebugManifest UP-TO-DATE
:CordovaLib:processDebugResources FAILED
FAILURE: Build failed with an exception.
What went wrong:
Execution failed for task ':CordovaLib:processDebugResources'.
java.io.IOException: Cannot run program "/android-sdk-linux/build-tools/23.0.2/aapt": error=2, No such file or directory
Try:
Run with --stacktrace option to get the stack trace. Run with --info or --debug option to get more log output.
BUILD FAILED
Total time: 29.25 secs
Starting app on Android Device \
/socially1-3/.meteor/local/cordova-build/platforms/android/cordova/node_modules/q/q.js:126
throw e;
^
Error code 1 for command: /socially1-3/.meteor/local/cordova-build/platforms/android/gradlew with args: cdvBuildDebug,-b,/socially1-3/.meteor/local/cordova-build/platforms/android/build.gradle,-PcdvBuildArch=arm,-Dorg.gradle.daemon=true
=> Errors executing Cordova commands:
While running Cordova app for platform Android with options --device:
Error: Command failed: /socially1-3/.meteor/local/cordova-build/platforms/android/cordova/run
--device
at ChildProcess.exitCallback (/tools/utils/processes.js:137:23)
at ChildProcess.emit (events.js:98:17)
at Process.ChildProcess.handle.onexit (childprocess.js:820:12)
ExitWithCode:1
I first thought the file 'aapt' was not available or no permission was there for that file. But the 'aapt' file is available at the specified path and user has read write permission too.
You are trying to run a 32bit file on 64bit system. Try
>file aapt
It should give you the following result
aapt: ELF 32-bit LSB shared object ...
SDK Manager is actually installing 32 bit file..
Try this fix:
(Using software centre or command lines) If your Ubuntu is a 32-bit OS then install libgl1-mesa-dev
In case of 64-bit OS install ia32-libs (Ubuntu 13.04 or earlier), or libgl1-mesa-dev:i386 (Ubuntu 13.10 and above)
refer: https://askubuntu.com/questions/318246/complete-installation-guide-for-android-sdk-adt-bundle-on-ubuntu
According to Android Developer Site,
Note:
If you are running a 64-bit version of Ubuntu, you need to install some 32-bit libraries with the following command:
sudo apt-get install lib32z1 lib32ncurses5 lib32bz2-1.0 lib32stdc++6
If you are running 64-bit Fedora, the command is:
sudo yum install zlib.i686 ncurses-libs.i686 bzip2-libs.i686
Follow the link for installation steps:
https://developer.android.com/studio/install.html

Resources